concepts
type: Collection
type: ConceptGroup
member: moral luck

moral luck
type: Concept
broader: theories of ethics
definition: Moral luck seems to appear when circumstances beyond a person's control influence our moral attributions of praise and blame. For example, consider the apparent role of moral luck in some of the worst failures in corporate history. [Source: Encyclopedia of Business Ethics and Society; Moral Luck]

theories of ethics
type: Concept
narrower: moral luck