concepts
type: Collection
type: ConceptGroup
member: moral realism

moral realism
type: Concept
broader: theories of ethics
definition: Moral realism is the metaethical view that there are moral facts and moral properties and that the existence of these facts and instantiation of these properties is essentially independent of any subjective stance. This view commits moral realists to three logically independent theses. [Source: Encyclopedia of Business Ethics and Society; Moral Realism]

theories of ethics
type: Concept
narrower: moral realism