concepts
type: Collection
type: ConceptGroup
member: moral relativism

moral relativism
type: Concept
broader: theories of ethics
definition: Definitional Issues Moral relativism is a theory that can be applied to individuals, to cultures, or to moral theories themselves. At the individual level, individual moral relativism would argue that whatever an individual thinks is right or wrong really is right or wrong for that individual. [Source: Encyclopedia of Business Ethics and Society; Relativism, Moral]

theories of ethics
type: Concept
narrower: moral relativism