assessment
type: Concept
narrower: motor assessment

concepts
type: Collection
type: ConceptGroup
member: motor assessment

motor assessment
type: Concept
broader: assessment
definition: Motor skills are generally evaluated during an assessment in the schools by an occupational and/or physical therapist. Motor performance is also considered an important part of a neuropsychological evaluation. [Source: Encyclopedia of School Psychology; Motor Assessment]