cities: historical overviews
type: Concept
narrower: multicultural cities

concepts
type: Collection
type: ConceptGroup
member: multicultural cities

multicultural cities
type: Concept
broader: cities: historical overviews
definition: At the beginning of the third millennium, more than half of the global population lives in cities. In addition, the United Nations reports that 3 percent of the global population lives outside of their country of birth. [Source: Encyclopedia of Urban Studies; Multicultural Cities]