concepts
type: Collection
type: ConceptGroup
member: multicultural education in Mexico

global dimensions of diversity
type: Concept
narrower: multicultural education in Mexico

multicultural education in Mexico
type: Concept
broader: global dimensions of diversity
definition: Explicitly multicultural and/or intercultural education is a very recent and still marginal educational phenomenon in Mexico. However, the long-standing Latin American and particularly Mexican tradition of indigenismo constitutes a kind of “multiculturalism avant la lettre” that still shapes the educational institutions specifically designed for the country's 68 indigenous peoples who make up approximately 10% of the Mexican population. [Source: Encyclopedia of Diversity in Education; Mexico, Multicultural Education in]