concepts
type: Collection
type: ConceptGroup
member: multiple-choice tests

multiple-choice tests
type: Concept
broader: testing, measurement, and evaluation
definition: Multiple-choice tests have perhaps the most popular testing format in education and elsewhere, and students are certainly aware of multiple-choice items. Multiple-choice test items begin with the problem typically expressed as an incomplete statement or question (also known as the stem) followed by alternatives from which to select (the options). [Source: Encyclopedia of Educational Psychology; Multiple-Choice Tests]

testing, measurement, and evaluation
type: Concept
narrower: multiple-choice tests