concepts
type: Collection
type: ConceptGroup
member: multiple disaster problem

issues in crisis management
type: Concept
narrower: multiple disaster problem

multiple disaster problem
type: Concept
broader: issues in crisis management
definition: A hurricane causes flooding, power outages, and widespread wind damage. An earthquake leads to an electrical fire that spreads through a neighborhood blocked off by quake damage. [Source: Encyclopedia of Crisis Management; Multiple Disaster Problem]