methods
type: Collection
type: ConceptGroup
member: needs analysis

design aspects
type: Concept
narrower: needs analysis

needs analysis
type: Concept
broader: design aspects
definition: Organizations about to implement or expand their use of GIS technology usually undergo a formal process called needs analysis to determine how GIS can be best applied to their specific business needs. Often called needs assessment or requirements definition, this process involves the study of the various business functions of the organization and the identification of the geographic information and processing needs of those functions that are consistent with the overall goals and mission of the organization. [Source: Encyclopedia of Geographic Information Science; Needs Analysis]