concepts
type: Collection
type: ConceptGroup
member: new literacy studies

inquiry and research
type: Concept
narrower: new literacy studies

new literacy studies
type: Concept
broader: inquiry and research
definition: New Literacy Studies (NLS) refers to an approach to literacy and literacy education underpinned by three central ideas. First, literacy is seen as a communicative tool, with the emphasis firmly placed on its intersubjective aspects. [Source: Encyclopedia of Curriculum Studies; New Literacy Studies]