concepts
type: Collection
type: ConceptGroup
member: new world order

foreign policy
type: Concept
narrower: new world order

new world order
type: Concept
broader: foreign policy
definition: New era in international relations and global economics following the end of the Cold War. The phrase new world order came from a speech in which President George H. W. Bush described the beginnings of the Gulf War. [Source: Encyclopedia of United States National Security; New World Order]