methods
type: Collection
type: ConceptGroup
member: object-based image analysis

object-based image analysis
type: Concept
broader: remote sensing
definition: Object-based image analysis (OBIA) is a new approach to the analysis of remote-sensing (RS) images in which the basic units, instead of being individual pixels, are image-objects. An image-object is a relatively uniform region of a digital image somewhat different from its surroundings. [Source: Encyclopedia of Geography; Object-Based Image Analysis]

remote sensing
type: Concept
narrower: object-based image analysis