concepts
type: Collection
type: ConceptGroup
member: object biographies

object biographies
type: Concept
broader: trends in consumer culture
definition: An object biography is a story told through an object. The term biography literally means the writing of a life, a life told as a story. [Source: Encyclopedia of Consumer Culture; Object Biographies]

trends in consumer culture
type: Concept
narrower: object biographies