assessment areas and techniques
type: Concept
narrower: occupational classification systems

concepts
type: Collection
type: ConceptGroup
member: occupational classification systems

occupational classification systems
type: Concept
broader: assessment areas and techniques
definition: Occupational classification systems are schemas for grouping jobs and job data. Government agencies often use occupational classification systems to standardize the way job data are collected and how jobs are described. [Source: Encyclopedia of Career Development; Occupational Classification Systems]