concepts
type: Collection
type: ConceptGroup
member: occupational commitment

occupational commitment
type: Concept
broader: variations in career patterns and career success
definition: The term career has been defined by several prominent behavioral scientists as a pattern of work-related experiences, including attitudes and behaviors, that span a person's life. Such a definition encompasses different work referents, including job involvement, organizational commitment, occupational commitment, and work/nonwork roles. [Source: Encyclopedia of Career Development; Occupational Commitment]

variations in career patterns and career success
type: Concept
narrower: occupational commitment