concepts
type: Collection
type: ConceptGroup
member: offshore banking

global economic issues
type: Concept
narrower: offshore banking

offshore banking
type: Concept
broader: global economic issues
definition: Offshore banking centers are located in places that are outside the customer's home country. Offshore banking is relevant to the field of global studies because of the global distribution and international reach of these financial centers and because of its impact on the global economy. [Source: Encyclopedia of Global Studies; Banking, Offshore]