anatomy
type: Concept
narrower: osteology

concepts
type: Collection
type: ConceptGroup
member: osteology

osteology
type: Concept
broader: anatomy
definition: Osteology is the scientific study of bones, especially human bones. The word osteology derives from the Greek for bones, and the term was first used in 1670. [Source: Encyclopedia of Global Health; Osteology]