concepts
type: Collection
type: ConceptGroup
member: oversight

oversight
type: Concept
broader: political process
definition: Oversight is a broad term used to describe a variety of actions related to management and supervision in accountability relationships. Oversight is often associated with efforts of a congress or parliament to manage agencies that implement policy. [Source: Encyclopedia of Governance; Oversight]

political process
type: Concept
narrower: oversight