bootstrapping
type: Concept
narrower: permutation

concepts
type: Collection
type: ConceptGroup
member: permutation

permutation
type: Concept
broader: bootstrapping
definition: The process of changing the order of an ordered set of objects. (b. [Source: Dictionary of Statistics & Methodology; Permutation]