concepts
type: Collection
type: ConceptGroup
member: person perception

person perception
type: Concept
broader: social cognition
definition: Definition Person perception refers to a general tendency to form impressions of other people. Some forms of person perception occur indirectly and require inferring information about a person based on observations of behaviors or based on second-hand information. [Source: Encyclopedia of Social Psychology; Person Perception]

social cognition
type: Concept
narrower: person perception