methods
type: Collection
type: ConceptGroup
member: phenomenological research

inquiry and research
type: Concept
narrower: phenomenological research

phenomenological research
type: Concept
broader: inquiry and research
definition: Phenomenology is a project of abstemious reflection on the lived experience of human existence abstemious, in the sense that reflecting on experience must, as much as possible, abstain from theoretical, prejudicial, and suppositional intoxications. But, phenomenology is also a project that is driven by fascination: being swept up in a spell of wonder, a fascination with meaning. [Source: Encyclopedia of Curriculum Studies; Phenomenological Research]