community-based housing
type: Concept
narrower: planned unit development

concepts
type: Collection
type: ConceptGroup
member: planned unit development

planned unit development
type: Concept
broader: community-based housing
definition: A planned unit development (PUD) is a land development technique that allows deviations from zoning and subdivision requirements in exchange for on-site or community benefits or both. As such, it has both benefits and limitations for a community, a landowner, and developer. [Source: The Encyclopedia of Housing; Planned Unit Development]