concepts
type: Collection
type: ConceptGroup
member: police structure: centralized/decentralized

international law enforcement
type: Concept
narrower: police structure: centralized/decentralized

police structure: centralized/decentralized
type: Concept
broader: international law enforcement
definition: There are two main aspects of police force structure to consider when thinking of police centralization or decentralization: 1. Level of subordination, which refers to aspects of the police hierarchy 2. [Source: Encyclopedia of Law Enforcement; Police Structure: Centralized/Decentralized]