methods
type: Collection
type: ConceptGroup
member: policy meta-analysis

policy meta-analysis
type: Concept
broader: public policy
definition: Policy meta-analysis is a research method that involves the quantitative analysis of independent data sets or other studies. It seeks to develop a synthesis of existing information and conclusions. [Source: The Encyclopedia of Political Science; Policy Meta-analysis]

public policy
type: Concept
narrower: policy meta-analysis