methods
type: Collection
type: ConceptGroup
member: political network analysis

political behavior
type: Concept
narrower: political network analysis

political network analysis
type: Concept
broader: political behavior
definition: Political networks are defined as all those networks that are politically relevant. Networks are specific types of relations (e.g., communication, support, influence, command and control, self-organization, persuasion, coalition, trade flows) between actors—individual, collective, corporate, private, public—and between actors and objects (e.g. [Source: The Encyclopedia of Political Science; Political Network Analysis]