methods
type: Collection
type: ConceptGroup
member: poststructuralist research

inquiry and research
type: Concept
narrower: poststructuralist research

poststructuralist research
type: Concept
broader: inquiry and research
definition: Curriculum poststructuralist researchers assume that varied conceptions of what and who shapes and constitutes curriculum are embedded in and enacted through historically, socially, and culturally situated discursive practices and constructions. Poststructuralist research focuses on the local, the fragmented, the ambivalent in knowledge creations as well as research processes and interpretations. [Source: Encyclopedia of Curriculum Studies; Poststructuralist Research]