concepts
type: Collection
type: ConceptGroup
member: pre-parole plan

parole
type: Concept
narrower: pre-parole plan

pre-parole plan
type: Concept
broader: parole
definition: Although the purposes of pre-parole and parole are different, the distinction is less mutually exclusive than it might appear. Pre-parole is intended to reduce prison overcrowding; parole is designed to help reintegrate the inmate into society. [Source: Encyclopedia of Community Corrections; Pre-Parole Plan]