assessment areas and techniques
type: Concept
narrower: proactivity

concepts
type: Collection
type: ConceptGroup
member: proactivity

proactivity
type: Concept
broader: assessment areas and techniques
definition: Proactivity refers to the idea that individuals initiate action and make constructive changes in their environment. As careers have become more fluid and self-structured, the concept of proactivity has become increasingly relevant to career development. [Source: Encyclopedia of Career Development; Proactivity]