concepts
type: Collection
type: ConceptGroup
member: probation: early termination

diversion and probation
type: Concept
narrower: probation: early termination

probation: early termination
type: Concept
broader: diversion and probation
definition: Probation is the most common form of criminal justice supervision in the United States. In 2011, there were more than 4.2 million adult offenders on probation—nearly three times as many as there were housed in state and federal prisons. [Source: Encyclopedia of Community Corrections; Probation: Early Termination]