concepts
type: Collection
type: ConceptGroup
member: probation and parole fees

diversion and probation
type: Concept
narrower: probation and parole fees

probation and parole fees
type: Concept
broader: diversion and probation
definition: The rise of probation and parole rates in the United States has had the effect of belaboring state criminal justice institutions. Already steward to the largest incarcerated population in world history, the United States also manages more than 5 million individuals on probation or parole. [Source: Encyclopedia of Community Corrections; Probation and Parole Fees]