ballot issue campaigns
type: Concept
narrower: provisional ballots

concepts
type: Collection
type: ConceptGroup
member: provisional ballots

provisional ballots
type: Concept
broader: ballot issue campaigns
definition: PROVISIONAL BALLOTS FORM part of the electoral reform process that emerged following the voting difficulties encountered in the 2000 U.S. presidential election. [Source: Encyclopedia of U.S. Campaigns, Elections, and Electoral Behavior; Provisional Ballots]