concepts
type: Collection
type: ConceptGroup
member: public diplomacy

foreign policy
type: Concept
narrower: public diplomacy

public diplomacy
type: Concept
broader: foreign policy
definition: Public diplomacy is the primary communication tool for governments to influence public opinion in foreign countries and as such, a vital tool in managing the reputation of countries. While traditional diplomacy is conducted between governments, public diplomacy is direct communication between a government (or governmental organization) and foreign citizens to evoke favorable opinions, attitudes, or behavior toward the country, its policies, and people. [Source: Encyclopedia of Public Relations; Public Diplomacy]