concepts
type: Collection
type: ConceptGroup
member: public finance reform

international finance
type: Concept
narrower: public finance reform

public finance reform
type: Concept
broader: international finance
definition: Public finance is concerned with the financing and administration of government activities—and thus includes taxation, expenditure, fiscal policies, monetary reform, and so forth. Public finance reform seeks to streamline and improve these activities. [Source: Encyclopedia of Business in Today's World; Public Finance Reform]