concepts
type: Collection
type: ConceptGroup
member: public utilities

public administration
type: Concept
narrower: public utilities

public utilities
type: Concept
broader: public administration
definition: Public utilities are organizations that provide public services. Public utilities may be government owned, cooperatives, or investor-owned enterprises. [Source: Green Energy: An A-to-Z Guide; Public Utilities]