concepts
type: Collection
type: ConceptGroup
member: purpose of program goals

instructional design
type: Concept
narrower: purpose of program goals

purpose of program goals
type: Concept
broader: instructional design
definition: Some years ago at a conference on bilingual education, a paper was delivered with the title “If Bilingual Education Is the Answer, What Is the Question?” The presentation suggested that all the stakeholders involved in bilingual education were not in agreement about its central purpose. Since then, many pages have been written about the effectiveness of bilingual education and its value in and out of the classroom. [Source: Encyclopedia of Bilingual Education; Program Goals, Purpose of]