assessment, testing, and research methods
type: Concept
narrower: quantitative methodologies

methods
type: Collection
type: ConceptGroup
member: quantitative methodologies

quantitative methodologies
type: Concept
broader: assessment, testing, and research methods
definition: Quantitative methodologies can be generally defined as the various procedures used to examine differences between groups and relationships between variables with respect to quantifiable phenomena. The list of potentially quantifiable phenomena is immense and includes any type of behavior, attitude, perception, Quantitative Methodologies knowledge domain, or other extant characteristic that can be measured numerically. [Source: Encyclopedia of Counseling; Quantitative Methodologies]