methods
type: Collection
type: ConceptGroup
member: quantitative research approach

quantitative research approach
type: Concept
broader: research methods for industrial and organizational psychology
definition: Quantitative research approaches increase our knowledge by gathering data that can be manipulated mathematically. This allows us to answer questions about the meanings of psychological concepts, as well as to determine their levels and variability as well as the relationships among them. [Source: Encyclopedia of Industrial and Organizational Psychology; Quantitative Research Approach]

research methods for industrial and organizational psychology
type: Concept
narrower: quantitative research approach