concepts
type: Collection
type: ConceptGroup
member: questioned documents/ink dating

forensics
type: Concept
narrower: questioned documents/ink dating

questioned documents/ink dating
type: Concept
broader: forensics
definition: The field of questioned documents examination covers several issues. The best known is the examination of handwriting, handprinting, and signatures for authorship. [Source: Encyclopedia of Crime and Punishment; Questioned Documents/Ink Dating]