concepts
type: Collection
type: ConceptGroup
member: race and education

race, ethnicity and education
type: Concept
narrower: race and education

race and education
type: Concept
broader: race, ethnicity and education
definition: Race is a highly contested term. Commonly assumed to relate to fixed and obvious biological characteristics, the differences that are viewed as racial are in fact socially constructed. [Source: Encyclopedia of Diversity in Education; Race and Education]