concepts
type: Collection
type: ConceptGroup
member: real hedge

international finance
type: Concept
narrower: real hedge

real hedge
type: Concept
broader: international finance
definition: The meaning of a real hedge varies with the context in which it is used. A real hedge involves taking of positions by investors to alter their exposure to risk. [Source: Encyclopedia of Business in Today's World; Real Hedge]