concepts
type: Collection
type: ConceptGroup
member: reparation boards

diversion and probation
type: Concept
narrower: reparation boards

reparation boards
type: Concept
broader: diversion and probation
definition: Innovative initiatives in community corrections have aimed at involving more lay counselors in managing offenders and delivering justice. One method for accomplishing this is the reparation board. [Source: Encyclopedia of Community Corrections; Reparation Boards]