concepts
type: Collection
type: ConceptGroup
member: reproduction theory

reproduction theory
type: Concept
broader: theoretical perspectives
definition: Reproduction theory was developed by Herbert Gintis in 1972 in his critique of Ivan Illich and was expanded by Gintis and Samuel Bowles in their seminal text Schooling in Capitalist America published in 1976. Although reproduction theory (also called correspondence theory) now applies to the social and cultural fields, Bowles and Gintis first approached this theory through the lenses of capitalism and the economy. [Source: Encyclopedia of Curriculum Studies; Reproduction Theory]

theoretical perspectives
type: Concept
narrower: reproduction theory