methods
type: Collection
type: ConceptGroup
member: reputational analysis

power and methodological issues
type: Concept
narrower: reputational analysis

reputational analysis
type: Concept
broader: power and methodological issues
definition: Reputational analysis is a method that has been used by some researchers to measure reputation, a key power resource. It was used first in the analysis of urban politics as a way to establish which local actors were most influential in any given community. [Source: Encyclopedia of Power; Reputational Analysis]