cartography
type: Concept
narrower: resource mapping

concepts
type: Collection
type: ConceptGroup
member: resource mapping

resource mapping
type: Concept
broader: cartography
definition: Resource mapping refers to the cartographic depiction of natural resources such as land, water, soil, minerals, forests, biological species, wind power, and so on. Thus, the phrase refers to the process of acquiring, analyzing, representing, and presenting information about the geographic distributions of these resources. [Source: Encyclopedia of Geography; Resource Mapping]