concepts
type: Collection
type: ConceptGroup
member: revocation

diversion and probation
type: Concept
narrower: revocation

revocation
type: Concept
broader: diversion and probation
definition: The legal and procedural process by which probation or parole may be withdrawn. Both probation and parole are conditional release from incarceration. [Source: The SAGE Glossary of the Social and Behavioral Sciences; Revocation]