agriculture
type: Concept
narrower: rice

concepts
type: Collection
type: ConceptGroup
member: rice

rice
type: Concept
broader: agriculture
definition: Rice, although produced in similar quantities to wheat and maize, feeds more people on the planet than any other grain and has done so for many centuries. Yet, in many forms of its cultivation it has led to significant environmental modification. [Source: Encyclopedia of Environment and Society; Rice]