concepts
type: Collection
type: ConceptGroup
member: roll off

representation and electoral systems
type: Concept
narrower: roll off

roll off
type: Concept
broader: representation and electoral systems
definition: Roll off is a form of incomplete voting participation. In modern elections, voters rarely are offered only one electoral position on a ballot. [Source: The Encyclopedia of Political Science; Roll Off]