concepts
type: Collection
type: ConceptGroup
member: sacred loss

religion
type: Concept
narrower: sacred loss

sacred loss
type: Concept
broader: religion
definition: Marriage is in most religions primarily contractual. However, for many religions and spiritual traditions, marriage also involves binding the souls or spirits of two or more individuals. [Source: Cultural Sociology of Divorce: An Encyclopedia; Sacred Loss]