children's games
type: Concept
narrower: sand play

concepts
type: Collection
type: ConceptGroup
member: sand play

sand play
type: Concept
broader: children's games
definition: The term sand play may conjure images of children at the beach or playing in a sandbox at the park, playground or school, developing physical, language, cognitive, social, and emotional skills and concepts such as wet and dry, pouring, digging, and volume. A variety of play types can be experienced through the use of sand. [Source: Encyclopedia of Play in Today's Society; Sand Play]