concepts
type: Collection
type: ConceptGroup
member: scholar networks

scholar networks
type: Concept
broader: social science of networking
definition: Scholar networks are networks between researchers working in academia and/or in other (private) research institutions. They indicate some form of research collaboration between the parties involved. [Source: Encyclopedia of Social Networks; Scholar Networks]

social science of networking
type: Concept
narrower: scholar networks